[Date Prev][Date Next][Thread Prev][Thread Next][Date Index][Thread Index]

failure "gnome libs" -current AMD64; 2/2/05 snapshot system



I'm trying to build a new system on AMD64 using the 2/2/05 snapshot.
got an error in the build of "gnome libs"

cc -DHAVE_CONFIG_H -I. -I. -I.. -I.. -I./.. -DNEED_GNOMESUPPORT_H
-I../support -I../support -I/usr/local/include
-I/usr/local/include/glib-1.2 -I/usr/local/include/orbit-1.0
-I/usr/local/include -I/usr/local/include -I/usr/local/include/gtk-1.2
-I/usr/local/include/glib-1.2 -I/usr/X11R6/include -I/usr/local/include
-I/usr/X11R6/include -DGNOMEBINDIR=/usr/local/bin
-DGNOMESYSCONFDIR=\"/etc\" -DVERSION=\"1.4.2\" -I/usr/local/include
-I/usr/local/include/libpng -I/usr/local/include/gtk-1.2
-I/usr/local/include/glib-1.2 -I/usr/X11R6/include -O2 -pipe -Wall
-Wunused -c Table-stubs.c  -fPIC -DPIC -o .libs/Table-stubs.lo
Table-stubs.c: In function `GNOME_Table_get':
Table-stubs.c:47: warning: implicit declaration of function `alloca'
cc -DHAVE_CONFIG_H -I. -I. -I.. -I.. -I./.. -DNEED_GNOMESUPPORT_H
-I../support -I../support -I/usr/local/include
-I/usr/local/include/glib-1.2 -I/usr/local/include/orbit-1.0
-I/usr/local/include -I/usr/local/include -I/usr/local/include/gtk-1.2
-I/usr/local/include/glib-1.2 -I/usr/X11R6/include -I/usr/local/include
-I/usr/X11R6/include -DGNOMEBINDIR=/usr/local/bin
-DGNOMESYSCONFDIR=\"/etc\" -DVERSION=\"1.4.2\" -I/usr/local/include
-I/usr/local/include/libpng -I/usr/local/include/gtk-1.2
-I/usr/local/include/glib-1.2 -I/usr/X11R6/include -O2 -pipe -Wall
-Wunused -c Table-stubs.c -o Table-stubs.o >/dev/null 2>&1
gmake[2]: *** [Table-stubs.lo] Error 1
gmake[2]: Leaving directory
`/usr/ports/x11/gnome/libs/w-gnome-libs-1.4.2p0/gnome-libs-1.4.2/libgnorba'
gmake[1]: *** [all-recursive] Error 1
gmake[1]: Leaving directory
`/usr/ports/x11/gnome/libs/w-gnome-libs-1.4.2p0/gnome-libs-1.4.2'
gmake: *** [all-recursive-am] Error 2
*** Error code 2